BDBM50485408 CHEMBL2057881
SMILES Clc1ccc(cc1)-c1nn(cc1CNc1ccc(Br)cc1)-c1ccccc1
InChI Key InChIKey=SWUBMYGOFVKITP-UHFFFAOYSA-N
Data  1 IC50
  Tab Delimited (TSV)   2D SDfile   Computed 3D by Vconf -m prep SDfile
Find this compound or compounds like it in BindingDB:
Activity Spreadsheet -- Enzyme Inhibition Constant Data from BindingDB
Found 1 hit for monomerid = 50485408
TargetCyclin-dependent kinase 2/G1/S-specific cyclin-E1(Homo sapiens (Human))
Changzhou University
Curated by ChEMBL
LigandPNGBDBM50485408(CHEMBL2057881)
Affinity DataIC50:  1.85E+3nM. Assay description: Inhibition of CDK2/cyclin E
Ligand InfoPC cidPC sid
In DepthDetails ArticlePubMed