BDBM50486243 MONOSULFURON ESTER
SMILES COC(=O)c1ccccc1S(=O)(=O)NC(=O)Nc1nccc(C)n1
InChI Key InChIKey=VGBNSONMEGTIDX-UHFFFAOYSA-N
Data  2 KI
PDB links: 1 PDB ID matches this monomer.
  Tab Delimited (TSV)   2D SDfile   Computed 3D by Vconf -m prep SDfile
Find this compound or compounds like it in BindingDB:
Activity Spreadsheet -- Enzyme Inhibition Constant Data from BindingDB
Found 2 hits for monomerid = 50486243
TargetAcetolactate synthase, chloroplastic(Arabidopsis thaliana)
Nankai University
Curated by ChEMBL
LigandPNGBDBM50486243(MONOSULFURON ESTER)
Affinity DataKi:  260nM. Assay description: Inhibition of wild type Arabidopsis thaliana acetohydroxyacid synthase colorimetric assay
Ligand InfoPC cidPC sidPDB
TargetAcetolactate synthase, chloroplastic(Arabidopsis thaliana)
Nankai University
Curated by ChEMBL
LigandPNGBDBM50486243(MONOSULFURON ESTER)
Affinity DataKi:  8.53E+3nM. Assay description: Inhibition of Arabidopsis thaliana acetohydroxyacid synthase W574L mutant colorimetric assay
Ligand InfoPC cidPC sidPDB