BDBM50488490 CHEMBL2286729
SMILES CCOc1cccc(C(=O)NN(C(=O)c2cc(C)cc(C)c2)C(C)(C)C)c1C
InChI Key InChIKey=PWJQXNCIMVWGQX-UHFFFAOYSA-N
Data  2 EC50
  Tab Delimited (TSV)   2D SDfile   Computed 3D by Vconf -m prep SDfile
Find this compound or compounds like it in BindingDB:
Activity Spreadsheet -- Enzyme Inhibition Constant Data from BindingDB
Found 2 hits for monomerid = 50488490
TargetProtein ultraspiracle(Drosophila melanogaster)
Ghent University
Curated by ChEMBL
LigandPNGBDBM50488490(CHEMBL2286729)
Affinity DataEC50:  1.20E+4nM. Assay description: Agonist activity at ecdysone receptor in Drosophila melanogaster S2 cells after 24 hr by luciferase reporter gene assay
Ligand InfoPC cidPC sid
In DepthDetails ArticlePubMed
TargetEcdysone receptor(Bombyx mori)
Ghent University
Curated by ChEMBL
LigandPNGBDBM50488490(CHEMBL2286729)
Affinity DataEC50:  52nM. Assay description: Agonist activity at ecdysone receptor in Bombyx mori Bm5 cells after 24 hr by luciferase reporter gene assay
Ligand InfoPC cidPC sid
In DepthDetails ArticlePubMed