BDBM50492097 CHEMBL2396965
SMILES [H][C@]12Cc3n[nH]cc3[C@]([H])(N1S(=O)(=O)c1cccc(c1)C(F)(F)F)c1cc(F)c(F)cc21
InChI Key InChIKey=XYRXKBBOJKFRBK-QZTJIDSGSA-N
Data  2 IC50
  Tab Delimited (TSV)   2D SDfile   Computed 3D by Vconf -m prep SDfile
Find this compound or compounds like it in BindingDB:
Activity Spreadsheet -- Enzyme Inhibition Constant Data from BindingDB
Found 2 hits for monomerid = 50492097
TargetPresenilin-1(Homo sapiens (Human))
Elan Pharmaceuticals
Curated by ChEMBL
LigandPNGBDBM50492097(CHEMBL2396965)
Affinity DataIC50:  127nM. Assay description: Inhibition of gamma-secretase in human IMR32 cell membrane using Notch as substrate after 2 hrs by ELISA
Ligand InfoPC cidPC sid
In DepthDetails ArticlePubMed
TargetPresenilin-1(Homo sapiens (Human))
Elan Pharmaceuticals
Curated by ChEMBL
LigandPNGBDBM50492097(CHEMBL2396965)
Affinity DataIC50:  1.10nM. Assay description: Inhibition of gamma-secretase in human IMR32 cell membrane using APP as substrate after 2 hrs by ELISA
Ligand InfoPC cidPC sid
In DepthDetails ArticlePubMed