BDBM50492098 CHEMBL2396963
SMILES [H][C@]12Cc3n[nH]cc3[C@]([H])(N1S(=O)(=O)c1cccc(n1)C(F)(F)F)c1cccc(F)c21
InChI Key InChIKey=AWIQEYTUYKAOPG-CXAGYDPISA-N
Data  2 IC50
  Tab Delimited (TSV)   2D SDfile   Computed 3D by Vconf -m prep SDfile
Find this compound or compounds like it in BindingDB:
Activity Spreadsheet -- Enzyme Inhibition Constant Data from BindingDB
Found 2 hits for monomerid = 50492098
TargetPresenilin-1(Homo sapiens (Human))
Elan Pharmaceuticals
Curated by ChEMBL
LigandPNGBDBM50492098(CHEMBL2396963)
Affinity DataIC50:  49nM. Assay description: Inhibition of gamma-secretase in human IMR32 cell membrane using Notch as substrate after 2 hrs by ELISA
Ligand InfoPC cidPC sid
In DepthDetails ArticlePubMed
TargetPresenilin-1(Homo sapiens (Human))
Elan Pharmaceuticals
Curated by ChEMBL
LigandPNGBDBM50492098(CHEMBL2396963)
Affinity DataIC50:  1nM. Assay description: Inhibition of gamma-secretase in human IMR32 cell membrane using APP as substrate after 2 hrs by ELISA
Ligand InfoPC cidPC sid
In DepthDetails ArticlePubMed