BDBM50492351 CHEMBL2403857
SMILES CC(C)(O)c1nc2cc(Cl)ccc2n1[C@@H]1CC[C@@H](CC1)NCC1Cc2ccccc2C1
InChI Key InChIKey=GLRDPMBWLXNFHJ-SZPZYZBQSA-N
Data  1 IC50  1 EC50
  Tab Delimited (TSV)   2D SDfile   Computed 3D by Vconf -m prep SDfile
Find this compound or compounds like it in BindingDB:
Activity Spreadsheet -- Enzyme Inhibition Constant Data from BindingDB
Found 2 hits for monomerid = 50492351
TargetMelanin-concentrating hormone receptor 1(Homo sapiens (Human))
Hoffmann-La Roche
Curated by ChEMBL
LigandPNGBDBM50492351(CHEMBL2403857)
Affinity DataIC50:  40nM. Assay description: Displacement of [125I]MCH peptide from human MCHR1 expressed in CHOK1 cells
Ligand InfoPC cidPC sid
In DepthDetails ArticlePubMed
TargetMelanin-concentrating hormone receptor 1(Homo sapiens (Human))
Hoffmann-La Roche
Curated by ChEMBL
LigandPNGBDBM50492351(CHEMBL2403857)
Affinity DataEC50:  40nM. Assay description: Antagonist activity at human MCHR1 expressed in CHOK1 cells assessed as inhibition of MCH/forskolin-stimulated cAMP production
Ligand InfoPC cidPC sid
In DepthDetails ArticlePubMed