BDBM50494484 CHEMBL3092176
SMILES CNS(=O)(=O)Nc1cccc(Cc2c(C)c3ccc(Oc4nccs4)cc3oc2=O)c1F
InChI Key InChIKey=OBWSQVNHYDMKLU-UHFFFAOYSA-N
Data  2 IC50
  Tab Delimited (TSV)   2D SDfile   Computed 3D by Vconf -m prep SDfile
Find this compound or compounds like it in BindingDB:
Activity Spreadsheet -- Enzyme Inhibition Constant Data from BindingDB
Found 2 hits for monomerid = 50494484
TargetRAF proto-oncogene serine/threonine-protein kinase(Homo sapiens (Human))
Chugai Pharmaceutical
Curated by ChEMBL
LigandPNGBDBM50494484(CHEMBL3092176)
Affinity DataIC50:  63nM. Assay description: Inhibition of C-Raf (unknown origin) assessed as phosphorylation of MEK1 after 45 mins by TR-FRET assay
Ligand InfoPC cidPC sid
In DepthDetails ArticlePubMed
TargetDual specificity mitogen-activated protein kinase kinase 1(Homo sapiens (Human))
Chugai Pharmaceutical
Curated by ChEMBL
LigandPNGBDBM50494484(CHEMBL3092176)
Affinity DataIC50:  26nM. Assay description: Inhibition of MEK1 (unknown origin) assessed as phosphorylation of Erk2 preincubated for 30 mins followed by FAM-Erktide addition measured after 60 m...
Ligand InfoPC cidPC sid
In DepthDetails ArticlePubMed