BDBM50494485 CHEMBL3092184
SMILES CN(C)C(=O)Oc1ccc2c(C)c(Cc3ccc(F)c(NS(N)(=O)=O)c3)c(=O)oc2c1
InChI Key InChIKey=TUPTVEGTTLLDFT-UHFFFAOYSA-N
Data  2 IC50
  Tab Delimited (TSV)   2D SDfile   Computed 3D by Vconf -m prep SDfile
Find this compound or compounds like it in BindingDB:
Activity Spreadsheet -- Enzyme Inhibition Constant Data from BindingDB
Found 2 hits for monomerid = 50494485
TargetDual specificity mitogen-activated protein kinase kinase 1(Homo sapiens (Human))
Chugai Pharmaceutical
Curated by ChEMBL
LigandPNGBDBM50494485(CHEMBL3092184)
Affinity DataIC50:  44nM. Assay description: Inhibition of MEK1 (unknown origin) assessed as phosphorylation of Erk2 preincubated for 30 mins followed by FAM-Erktide addition measured after 60 m...
Ligand InfoPC cidPC sid
In DepthDetails ArticlePubMed
TargetRAF proto-oncogene serine/threonine-protein kinase(Homo sapiens (Human))
Chugai Pharmaceutical
Curated by ChEMBL
LigandPNGBDBM50494485(CHEMBL3092184)
Affinity DataIC50:  1.10E+3nM. Assay description: Inhibition of C-Raf (unknown origin) assessed as phosphorylation of MEK1 after 45 mins by TR-FRET assay
Ligand InfoPC cidPC sid
In DepthDetails ArticlePubMed