BDBM50497126 CHEMBL3275469
SMILES [H][C@@]12Oc3c4c(C[C@@]5([H])N(CC[C@@]14[C@@]5([H])C=C[C@@H]2O)C1CCCCCC1)ccc3O
InChI Key InChIKey=WAQRKTFLMCNKNB-JIAAILLZSA-N
Data  2 IC50
  Tab Delimited (TSV)   2D SDfile   Computed 3D by Vconf -m prep SDfile
Find this compound or compounds like it in BindingDB:
Activity Spreadsheet -- Enzyme Inhibition Constant Data from BindingDB
Found 2 hits for monomerid = 50497126
TargetDelta-type/Kappa-type/Mu-type opioid receptor(Rattus norvegicus (rat))
TBA
Curated by ChEMBL
LigandPNGBDBM50497126(CHEMBL3275469)
Affinity DataIC50:  19nM. Assay description: Displacement of [3H]-naloxone from rat opioid receptor after 30 mins by liquid scintillation counting analysis in absence of NaCl
Ligand InfoPC cidPC sid
In DepthDetails ArticlePubMed
TargetDelta-type/Kappa-type/Mu-type opioid receptor(Rattus norvegicus (rat))
TBA
Curated by ChEMBL
LigandPNGBDBM50497126(CHEMBL3275469)
Affinity DataIC50:  150nM. Assay description: Displacement of [3H]-naloxone from rat opioid receptor after 30 mins by liquid scintillation counting analysis in presence of NaCl
Ligand InfoPC cidPC sid
In DepthDetails ArticlePubMed