BDBM50497128 CHEMBL3275472
SMILES [H][C@@]12Oc3c4c(C[C@@]5([H])N(CCc6ccccc6)CC[C@@]14[C@@]5([H])C=C[C@@H]2O)ccc3O
InChI Key InChIKey=BXKJGGVENHTVBF-JFDOVZFRSA-N
Data  2 IC50
  Tab Delimited (TSV)   2D SDfile   Computed 3D by Vconf -m prep SDfile
Find this compound or compounds like it in BindingDB:
Activity Spreadsheet -- Enzyme Inhibition Constant Data from BindingDB
Found 2 hits for monomerid = 50497128
TargetDelta-type/Kappa-type/Mu-type opioid receptor(Rattus norvegicus (rat))
TBA
Curated by ChEMBL
LigandPNGBDBM50497128(CHEMBL3275472)
Affinity DataIC50:  4.20nM. Assay description: Displacement of [3H]-naloxone from rat opioid receptor after 30 mins by liquid scintillation counting analysis in absence of NaCl
Ligand InfoPC cidPC sid
In DepthDetails ArticlePubMed
TargetDelta-type/Kappa-type/Mu-type opioid receptor(Rattus norvegicus (rat))
TBA
Curated by ChEMBL
LigandPNGBDBM50497128(CHEMBL3275472)
Affinity DataIC50:  133nM. Assay description: Displacement of [3H]-naloxone from rat opioid receptor after 30 mins by liquid scintillation counting analysis in presence of NaCl
Ligand InfoPC cidPC sid
In DepthDetails ArticlePubMed