BDBM50497370 CHEMBL3339114
SMILES Cc1cc(NC(=O)Nc2cc(nn2-c2ccccc2)C2(C)CC2)ccc1F
InChI Key InChIKey=XBRDFDHQDNGPAA-UHFFFAOYSA-N
Data  2 IC50
  Tab Delimited (TSV)   2D SDfile   Computed 3D by Vconf -m prep SDfile
Find this compound or compounds like it in BindingDB:
Activity Spreadsheet -- Enzyme Inhibition Constant Data from BindingDB
Found 2 hits for monomerid = 50497370
TargetG protein-activated inward rectifier potassium channel 1(Homo sapiens (Human))
Northwest A&F University
Curated by ChEMBL
LigandPNGBDBM50497370(CHEMBL3339114)
Affinity DataIC50:  1.00E+3nM. Assay description: Inhibition of GIRK1/2 (unknown origin) by thallium-flux based assay
Ligand InfoPC cidPC sid
In DepthDetails ArticlePubMed
TargetG protein-activated inward rectifier potassium channel 4(Homo sapiens (Human))
Northwest A&F University
Curated by ChEMBL
LigandPNGBDBM50497370(CHEMBL3339114)
Affinity DataIC50:  930nM. Assay description: Inhibition of GIRK1/4 (unknown origin) by thallium-flux based assay
Ligand InfoPC cidPC sid
In DepthDetails ArticlePubMed