BDBM50500092 CHEMBL3741937
SMILES OC(=O)c1ccc(NC(c2ccc(Br)cc2)c2ccc3ccccc3c2O)cc1
InChI Key InChIKey=JFERHQFYDYZVIT-UHFFFAOYSA-N
Data  1 IC50
  Tab Delimited (TSV)   2D SDfile   Computed 3D by Vconf -m prep SDfile
Find this compound or compounds like it in BindingDB:
Activity Spreadsheet -- Enzyme Inhibition Constant Data from BindingDB
Found 1 hit for monomerid = 50500092
TargetCAAX prenyl protease 2(Homo sapiens (Human))
New York University Abu Dhabi
Curated by ChEMBL
LigandPNGBDBM50500092(CHEMBL3741937)
Affinity DataIC50:  3.90E+3nM. Assay description: Inhibition of human Rce1-mediated CaaX protease activity using ABZ-KSKTKC(farnesyl)QIIM and ABZ-KSKTKC(farnesyl)VIQI as substrate assessed as residua...
Ligand InfoPC cidPC sid
In DepthDetails ArticlePubMed