BDBM50500094 CHEMBL3740203
SMILES OC(=O)c1ccc(NC(c2ccc(Br)cc2)c2ccc3cccnc3c2O)cc1
InChI Key InChIKey=PKCXEKWXPIBUME-UHFFFAOYSA-N
Data  1 IC50
  Tab Delimited (TSV)   2D SDfile   Computed 3D by Vconf -m prep SDfile
Find this compound or compounds like it in BindingDB:
Activity Spreadsheet -- Enzyme Inhibition Constant Data from BindingDB
Found 1 hit for monomerid = 50500094
TargetCAAX prenyl protease 2(Homo sapiens (Human))
New York University Abu Dhabi
Curated by ChEMBL
LigandPNGBDBM50500094(CHEMBL3740203)
Affinity DataIC50:  6.70E+3nM. Assay description: Inhibition of human Rce1-mediated CaaX protease activity using ABZ-KSKTKC(farnesyl)QIIM and ABZ-KSKTKC(farnesyl)VIQI as substrate assessed as residua...
Ligand InfoPC cidPC sid
In DepthDetails ArticlePubMed