BDBM50500096 CHEMBL3739720
SMILES OC(=O)c1ccc(NC(c2cccnc2)c2ccc3cccnc3c2O)cc1
InChI Key InChIKey=GBMKAWBYRBHVGK-UHFFFAOYSA-N
Data  1 IC50
  Tab Delimited (TSV)   2D SDfile   Computed 3D by Vconf -m prep SDfile
Find this compound or compounds like it in BindingDB:
Activity Spreadsheet -- Enzyme Inhibition Constant Data from BindingDB
Found 1 hit for monomerid = 50500096
TargetCAAX prenyl protease 2(Homo sapiens (Human))
New York University Abu Dhabi
Curated by ChEMBL
LigandPNGBDBM50500096(CHEMBL3739720)
Affinity DataIC50:  1.40E+4nM. Assay description: Inhibition of human Rce1-mediated CaaX protease activity using ABZ-KSKTKC(farnesyl)QIIM and ABZ-KSKTKC(farnesyl)VIQI as substrate assessed as residua...
Ligand InfoPC cidPC sid
In DepthDetails ArticlePubMed