BDBM50500106 CHEMBL3741673
SMILES Oc1c(cc(Br)c2ccccc12)C(Nc1ccccc1)c1ccccc1
InChI Key InChIKey=OCSHEBWCPJBUQL-UHFFFAOYSA-N
Data  1 IC50
  Tab Delimited (TSV)   2D SDfile   Computed 3D by Vconf -m prep SDfile
Find this compound or compounds like it in BindingDB:
Activity Spreadsheet -- Enzyme Inhibition Constant Data from BindingDB
Found 1 hit for monomerid = 50500106
TargetCAAX prenyl protease 2(Homo sapiens (Human))
New York University Abu Dhabi
Curated by ChEMBL
LigandPNGBDBM50500106(CHEMBL3741673)
Affinity DataIC50:  5.40E+3nM. Assay description: Inhibition of human Rce1-mediated CaaX protease activity using ABZ-KSKTKC(farnesyl)QIIM and ABZ-KSKTKC(farnesyl)VIQI as substrate assessed as residua...
Ligand InfoPC cidPC sid
In DepthDetails ArticlePubMed