BDBM50500108 CHEMBL3740917
SMILES OC(=O)c1ccc(NC(c2ccc(cc2)C#N)c2ccc3cccnc3c2O)cc1
InChI Key InChIKey=YHIFRUGWHRCQLL-UHFFFAOYSA-N
Data  1 IC50
  Tab Delimited (TSV)   2D SDfile   Computed 3D by Vconf -m prep SDfile
Find this compound or compounds like it in BindingDB:
Activity Spreadsheet -- Enzyme Inhibition Constant Data from BindingDB
Found 1 hit for monomerid = 50500108
TargetCAAX prenyl protease 2(Homo sapiens (Human))
New York University Abu Dhabi
Curated by ChEMBL
LigandPNGBDBM50500108(CHEMBL3740917)
Affinity DataIC50:  1.60E+4nM. Assay description: Inhibition of human Rce1-mediated CaaX protease activity using ABZ-KSKTKC(farnesyl)QIIM and ABZ-KSKTKC(farnesyl)VIQI as substrate assessed as residua...
Ligand InfoPC cidPC sid
In DepthDetails ArticlePubMed