BDBM50501750 CHEMBL4096676
SMILES CC(=O)c1cc(C(N)=O)n(C\C=C\c2ccccc2)c1
InChI Key InChIKey=ZWENKFFLAIDEEZ-VMPITWQZSA-N
Data  1 KI
  Tab Delimited (TSV)   2D SDfile   Computed 3D by Vconf -m prep SDfile
Find this compound or compounds like it in BindingDB:
Activity Spreadsheet -- Enzyme Inhibition Constant Data from BindingDB
Found 1 hit for monomerid = 50501750
TargetGenome polyprotein(Coxsackievirus B3 (strain Nancy))
Freie Universit£T Berlin
Curated by ChEMBL
LigandPNGBDBM50501750(CHEMBL4096676)
Affinity DataKi:  1.97E+5nM. Assay description: Reversible inhibition of Coxsackievirus B3 C-terminal His6-tagged protease 3C expressed in Escherichia coli BL21(DE3) using N-Dabcyl-KTLEALFQGPPVYE-(...
Ligand InfoPC cidPC sid
In DepthDetails ArticlePubMed