BDBM50502554 CHEMBL4533030
SMILES CN(CCCCN1C(=O)CCc2ccccc12)Cc1ccc(C)cc1C
InChI Key InChIKey=XSXHPHKBHYXVMP-UHFFFAOYSA-N
Data  3 KI
  Tab Delimited (TSV)   2D SDfile   Computed 3D by Vconf -m prep SDfile
Find this compound or compounds like it in BindingDB:
Activity Spreadsheet -- Enzyme Inhibition Constant Data from BindingDB
Found 3 hits for monomerid = 50502554
TargetGlutamate receptor ionotropic, NMDA 1/2B(Homo sapiens (Human))
University Of Trieste
Curated by ChEMBL
LigandPNGBDBM50502554(CHEMBL4533030)
Affinity DataKi:  5nM. Assay description: Displacement of [3H]ifenprodil from GluN1a/GluN2B (unknown origin) expressed in mouse L(tk-) cell membranes after 120 mins by solid scintillation cou...
Ligand InfoPC cidPC sid
In DepthDetails ArticlePubMed
TargetSigma intracellular receptor 2(Rattus norvegicus (Rat))
University Of Trieste
Curated by ChEMBL
LigandPNGBDBM50502554(CHEMBL4533030)
Affinity DataKi:  32nM. Assay description: Displacement of [3H]-di-o-tolylguanidine from sigma2 receptor in rat liver membranes in the presence of sigma1 receptor ligand (+)-pentazocine incuba...
Ligand InfoPC cidPC sid
In DepthDetails ArticlePubMed
TargetSigma non-opioid intracellular receptor 1(Cavia porcellus (Guinea pig))
University Of Trieste
Curated by ChEMBL
LigandPNGBDBM50502554(CHEMBL4533030)
Affinity DataKi:  60nM. Assay description: Displacement of [3H]-(+)-pentazocine from sigma1 receptor in guinea pig brain cortex membranes incubated for 120 mins by solid scintillation counting...
Ligand InfoPC cidPC sid
In DepthDetails ArticlePubMed