BDBM50503004 CHEMBL4518273
SMILES Cc1nc(c([nH]1)-c1ccnc(NC(=O)C2CC2)c1)-c1ccc2OCOc2c1
InChI Key InChIKey=PNVSGLKCKYGCFI-UHFFFAOYSA-N
Data  2 IC50
  Tab Delimited (TSV)   2D SDfile   Computed 3D by Vconf -m prep SDfile
Find this compound or compounds like it in BindingDB:
Activity Spreadsheet -- Enzyme Inhibition Constant Data from BindingDB
Found 2 hits for monomerid = 50503004
TargetMitogen-activated protein kinase 14(Homo sapiens (Human))
Eberhard Karls Universit£T T£Bingen
Curated by ChEMBL
LigandPNGBDBM50503004(CHEMBL4518273)
Affinity DataIC50:  30nM. Assay description: Inhibition of P38alpha MAPK (unknown origin) by ADP-Glo assay
Ligand InfoPC cidPC sid
In DepthDetails ArticlePubMed
TargetGlycogen synthase kinase-3 beta(Homo sapiens (Human))
Eberhard Karls Universit£T T£Bingen
Curated by ChEMBL
LigandPNGBDBM50503004(CHEMBL4518273)
Affinity DataIC50:  467nM. Assay description: Inhibition of GSK3beta (unknown origin) by ADP-Glo assay
Ligand InfoPC cidPC sid
In DepthDetails ArticlePubMed