BDBM50503012 CHEMBL4529679
SMILES NC(=O)c1nc(c([nH]1)-c1ccnc(NC(=O)C2CC2)c1)-c1cccc(OC(F)(F)F)c1
InChI Key InChIKey=ZUOGMOOYZHKZLK-UHFFFAOYSA-N
Data  2 IC50
  Tab Delimited (TSV)   2D SDfile   Computed 3D by Vconf -m prep SDfile
Find this compound or compounds like it in BindingDB:
Activity Spreadsheet -- Enzyme Inhibition Constant Data from BindingDB
Found 2 hits for monomerid = 50503012
TargetMitogen-activated protein kinase 14(Homo sapiens (Human))
Eberhard Karls Universit£T T£Bingen
Curated by ChEMBL
LigandPNGBDBM50503012(CHEMBL4529679)
Affinity DataIC50:  2.04E+3nM. Assay description: Inhibition of P38alpha MAPK (unknown origin) by ADP-Glo assay
Ligand InfoPC cidPC sid
In DepthDetails ArticlePubMed
TargetGlycogen synthase kinase-3 beta(Homo sapiens (Human))
Eberhard Karls Universit£T T£Bingen
Curated by ChEMBL
LigandPNGBDBM50503012(CHEMBL4529679)
Affinity DataIC50:  352nM. Assay description: Inhibition of GSK3beta (unknown origin) by ADP-Glo assay
Ligand InfoPC cidPC sid
In DepthDetails ArticlePubMed