BDBM50503016 CHEMBL4456432
SMILES NC(=O)c1ncc([nH]1)-c1ccnc(NC(=O)C2CC2)c1
InChI Key InChIKey=SRQBECQDCCTULV-UHFFFAOYSA-N
Data  2 IC50
  Tab Delimited (TSV)   2D SDfile   Computed 3D by Vconf -m prep SDfile
Find this compound or compounds like it in BindingDB:
Activity Spreadsheet -- Enzyme Inhibition Constant Data from BindingDB
Found 2 hits for monomerid = 50503016
TargetGlycogen synthase kinase-3 beta(Homo sapiens (Human))
Eberhard Karls Universit£T T£Bingen
Curated by ChEMBL
LigandPNGBDBM50503016(CHEMBL4456432)
Affinity DataIC50:  47nM. Assay description: Inhibition of GSK3beta (unknown origin) by ADP-Glo assay
Ligand InfoPC cidPC sid
In DepthDetails ArticlePubMed
TargetMitogen-activated protein kinase 14(Homo sapiens (Human))
Eberhard Karls Universit£T T£Bingen
Curated by ChEMBL
LigandPNGBDBM50503016(CHEMBL4456432)
Affinity DataIC50: >1.00E+4nM. Assay description: Inhibition of P38alpha MAPK (unknown origin) by ELISA
Ligand InfoPC cidPC sid
In DepthDetails ArticlePubMed