BDBM50503021 CHEMBL4475448
SMILES Cc1nc(C2CCCCC2)c([nH]1)-c1ccnc(NC(=O)C2CC2)c1
InChI Key InChIKey=AORKUDLTGIGDBR-UHFFFAOYSA-N
Data  2 IC50
  Tab Delimited (TSV)   2D SDfile   Computed 3D by Vconf -m prep SDfile
Find this compound or compounds like it in BindingDB:
Activity Spreadsheet -- Enzyme Inhibition Constant Data from BindingDB
Found 2 hits for monomerid = 50503021
TargetMitogen-activated protein kinase 14(Homo sapiens (Human))
Eberhard Karls Universit£T T£Bingen
Curated by ChEMBL
LigandPNGBDBM50503021(CHEMBL4475448)
Affinity DataIC50: >1.00E+4nM. Assay description: Inhibition of P38alpha MAPK (unknown origin) by ADP-Glo assay
Ligand InfoPC cidPC sid
In DepthDetails ArticlePubMed
TargetGlycogen synthase kinase-3 beta(Homo sapiens (Human))
Eberhard Karls Universit£T T£Bingen
Curated by ChEMBL
LigandPNGBDBM50503021(CHEMBL4475448)
Affinity DataIC50:  4.64E+3nM. Assay description: Inhibition of GSK3beta (unknown origin) by ADP-Glo assay
Ligand InfoPC cidPC sid
In DepthDetails ArticlePubMed