BDBM50503503 CHEMBL4548929::US10626103, Example 22
SMILES Cc1c(nc(-c2ccc(C#N)c(F)c2)n1-c1ccc2nn(C)cc2c1)C(=O)N1CC[C@H](N)C1
InChI Key InChIKey=DMZLEBPFOCGGNB-SFHVURJKSA-N
Data  2 IC50  1 EC50
  Tab Delimited (TSV)   2D SDfile   Computed 3D by Vconf -m prep SDfile
Find this compound or compounds like it in BindingDB:
Activity Spreadsheet -- Enzyme Inhibition Constant Data from BindingDB
Found 3 hits for monomerid = 50503503
TargetLysine-specific histone demethylase 1A(Homo sapiens (Human))
Celgene
Curated by ChEMBL
LigandPNGBDBM50503503(CHEMBL4548929 | US10626103, Example 22)
Affinity DataIC50:  3nM. Assay description: Inhibition of LSD1 (unknown origin)
Ligand InfoPC cidPC sid
In DepthDetails ArticlePubMed
TargetLysine-specific histone demethylase 1A(Homo sapiens (Human))
Celgene
Curated by ChEMBL
LigandPNGBDBM50503503(CHEMBL4548929 | US10626103, Example 22)
Affinity DataIC50: <100nM. Assay description: The enzymatic assay of LSD1 activity is based on Time Resolved-Fluorescence Resonance Energy Transfer (TR-FRET) detection. The inhibitory properties ...
Ligand InfoPC cidPC sid
In DepthDetails US Patent
TargetLysine-specific histone demethylase 1A(Homo sapiens (Human))
Celgene
Curated by ChEMBL
LigandPNGBDBM50503503(CHEMBL4548929 | US10626103, Example 22)
Affinity DataEC50:  26nM. Assay description: Inhibition of LSD1 in human THP1 cells assessed as induction of CD11b expression after 4 days by LIVE/DEAD violet staining based FACS analysis
Ligand InfoPC cidPC sid
In DepthDetails ArticlePubMed