BDBM50504903 CHEMBL4454599
SMILES CCCCNC(=O)c1cc(c(Br)cc1S(=O)(=O)C1CCCCC1)S(N)(=O)=O
InChI Key InChIKey=ADZJIEUIYRWVJN-UHFFFAOYSA-N
Data  24 Kd
  Tab Delimited (TSV)   2D SDfile   Computed 3D by Vconf -m prep SDfile
Find this compound or compounds like it in BindingDB:
Activity Spreadsheet -- Enzyme Inhibition Constant Data from BindingDB
Found 24 hits for monomerid = 50504903
TargetCarbonic anhydrase 3(Homo sapiens (Human))
Vilnius University
Curated by ChEMBL
LigandPNGBDBM50504903(CHEMBL4454599)
Affinity DataKd:  470nM. Assay description: Binding affinity to recombinant human carbonic anhydrase 3 expressed in Escherichia coli expression system assessed as kinetic dissociation constant ...
Ligand InfoPC cidPC sid
In DepthDetails ArticlePubMed
TargetCarbonic anhydrase 12(Homo sapiens (Human))
Vilnius University
Curated by ChEMBL
LigandPNGBDBM50504903(CHEMBL4454599)
Affinity DataKd:  0.100nM. Assay description: Binding affinity to recombinant human carbonic anhydrase 12 expressed in Escherichia coli expression system assessed as kinetic dissociation constant...
Ligand InfoPC cidPC sid
In DepthDetails ArticlePubMed
TargetCarbonic anhydrase 12(Homo sapiens (Human))
Vilnius University
Curated by ChEMBL
LigandPNGBDBM50504903(CHEMBL4454599)
Affinity DataKd:  5nM. Assay description: Binding affinity to recombinant human carbonic anhydrase 12 expressed in Escherichia coli expression system assessed as observed dissociation constan...
Ligand InfoPC cidPC sid
In DepthDetails ArticlePubMed
TargetCarbonic anhydrase 13(Homo sapiens (Human))
Vilnius University
Curated by ChEMBL
LigandPNGBDBM50504903(CHEMBL4454599)
Affinity DataKd:  0.340nM. Assay description: Binding affinity to recombinant human carbonic anhydrase 13 expressed in Escherichia coli expression system assessed as kinetic dissociation constant...
Ligand InfoPC cidPC sid
In DepthDetails ArticlePubMed
TargetCarbonic anhydrase 7(Homo sapiens (Human))
Vilnius University
Curated by ChEMBL
LigandPNGBDBM50504903(CHEMBL4454599)
Affinity DataKd:  2nM. Assay description: Binding affinity to recombinant human carbonic anhydrase 7 expressed in Escherichia coli expression system assessed as observed dissociation constant...
Ligand InfoPC cidPC sid
In DepthDetails ArticlePubMed
TargetCarbonic anhydrase 14(Homo sapiens (Human))
Vilnius University
Curated by ChEMBL
LigandPNGBDBM50504903(CHEMBL4454599)
Affinity DataKd:  5nM. Assay description: Binding affinity to recombinant human carbonic anhydrase 14 expressed in Escherichia coli expression system assessed as observed dissociation constan...
Ligand InfoPC cidPC sid
In DepthDetails ArticlePubMed
TargetCarbonic anhydrase 5B, mitochondrial(Homo sapiens (Human))
Vilnius University
Curated by ChEMBL
LigandPNGBDBM50504903(CHEMBL4454599)
Affinity DataKd:  0.320nM. Assay description: Binding affinity to recombinant human carbonic anhydrase 5b expressed in Escherichia coli expression system assessed as kinetic dissociation constant...
Ligand InfoPC cidPC sid
In DepthDetails ArticlePubMed
TargetCarbonic anhydrase 2(Homo sapiens (Human))
Vilnius University
Curated by ChEMBL
LigandPNGBDBM50504903(CHEMBL4454599)
Affinity DataKd:  2.5nM. Assay description: Binding affinity to recombinant human carbonic anhydrase 2 expressed in Escherichia coli expression system assessed as observed dissociation constant...
Ligand InfoPC cidPC sid
In DepthDetails ArticlePubMed
TargetCarbonic anhydrase 3(Homo sapiens (Human))
Vilnius University
Curated by ChEMBL
LigandPNGBDBM50504903(CHEMBL4454599)
Affinity DataKd:  3.70E+4nM. Assay description: Binding affinity to recombinant human carbonic anhydrase 3 expressed in Escherichia coli expression system assessed as observed dissociation constant...
Ligand InfoPC cidPC sid
In DepthDetails ArticlePubMed
TargetCarbonic anhydrase 6(Homo sapiens (Human))
Vilnius University
Curated by ChEMBL
LigandPNGBDBM50504903(CHEMBL4454599)
Affinity DataKd:  2.40nM. Assay description: Binding affinity to recombinant human carbonic anhydrase 6 expressed in Escherichia coli expression system assessed as kinetic dissociation constant ...
Ligand InfoPC cidPC sid
In DepthDetails ArticlePubMed
TargetCarbonic anhydrase 1(Homo sapiens (Human))
Vilnius University
Curated by ChEMBL
LigandPNGBDBM50504903(CHEMBL4454599)
Affinity DataKd:  64nM. Assay description: Binding affinity to recombinant human carbonic anhydrase 1 expressed in Escherichia coli expression system assessed as kinetic dissociation constant ...
Ligand InfoPC cidPC sid
In DepthDetails ArticlePubMed
TargetCarbonic anhydrase 4(Homo sapiens (Human))
Vilnius University
Curated by ChEMBL
LigandPNGBDBM50504903(CHEMBL4454599)
Affinity DataKd:  110nM. Assay description: Binding affinity to recombinant human carbonic anhydrase 4 expressed in Escherichia coli expression system assessed as observed dissociation constant...
Ligand InfoPC cidPC sid
In DepthDetails ArticlePubMed
TargetCarbonic anhydrase 5A, mitochondrial(Homo sapiens (Human))
Vilnius University
Curated by ChEMBL
LigandPNGBDBM50504903(CHEMBL4454599)
Affinity DataKd:  3.60E+3nM. Assay description: Binding affinity to recombinant human carbonic anhydrase 5a expressed in Escherichia coli expression system assessed as observed dissociation constan...
Ligand InfoPC cidPC sid
In DepthDetails ArticlePubMed
TargetCarbonic anhydrase 5B, mitochondrial(Homo sapiens (Human))
Vilnius University
Curated by ChEMBL
LigandPNGBDBM50504903(CHEMBL4454599)
Affinity DataKd:  12nM. Assay description: Binding affinity to recombinant human carbonic anhydrase 5b expressed in Escherichia coli expression system assessed as observed dissociation constan...
Ligand InfoPC cidPC sid
In DepthDetails ArticlePubMed
TargetCarbonic anhydrase 9(Homo sapiens (Human))
Vilnius University
Curated by ChEMBL
LigandPNGBDBM50504903(CHEMBL4454599)
Affinity DataKd:  0.00400nM. Assay description: Binding affinity to recombinant human carbonic anhydrase 9 expressed in mammalian cell expression system assessed as kinetic dissociation constant fl...
Ligand InfoPC cidPC sid
In DepthDetails ArticlePubMed
TargetCarbonic anhydrase 6(Homo sapiens (Human))
Vilnius University
Curated by ChEMBL
LigandPNGBDBM50504903(CHEMBL4454599)
Affinity DataKd:  500nM. Assay description: Binding affinity to recombinant human carbonic anhydrase 6 expressed in Escherichia coli expression system assessed as observed dissociation constant...
Ligand InfoPC cidPC sid
In DepthDetails ArticlePubMed
TargetCarbonic anhydrase 13(Homo sapiens (Human))
Vilnius University
Curated by ChEMBL
LigandPNGBDBM50504903(CHEMBL4454599)
Affinity DataKd:  7.10nM. Assay description: Binding affinity to recombinant human carbonic anhydrase 13 expressed in Escherichia coli expression system assessed as observed dissociation constan...
Ligand InfoPC cidPC sid
In DepthDetails ArticlePubMed
TargetCarbonic anhydrase 2(Homo sapiens (Human))
Vilnius University
Curated by ChEMBL
LigandPNGBDBM50504903(CHEMBL4454599)
Affinity DataKd:  0.0600nM. Assay description: Binding affinity to recombinant human carbonic anhydrase 2 expressed in Escherichia coli expression system assessed as kinetic dissociation constant ...
Ligand InfoPC cidPC sid
In DepthDetails ArticlePubMed
TargetCarbonic anhydrase 1(Homo sapiens (Human))
Vilnius University
Curated by ChEMBL
LigandPNGBDBM50504903(CHEMBL4454599)
Affinity DataKd:  1.30E+3nM. Assay description: Binding affinity to recombinant human carbonic anhydrase 1 expressed in Escherichia coli expression system assessed as observed dissociation constant...
Ligand InfoPC cidPC sid
In DepthDetails ArticlePubMed
TargetCarbonic anhydrase 4(Homo sapiens (Human))
Vilnius University
Curated by ChEMBL
LigandPNGBDBM50504903(CHEMBL4454599)
Affinity DataKd:  1.60nM. Assay description: Binding affinity to recombinant human carbonic anhydrase 4 expressed in Escherichia coli expression system assessed as kinetic dissociation constant ...
Ligand InfoPC cidPC sid
In DepthDetails ArticlePubMed
TargetCarbonic anhydrase 5A, mitochondrial(Homo sapiens (Human))
Vilnius University
Curated by ChEMBL
LigandPNGBDBM50504903(CHEMBL4454599)
Affinity DataKd:  130nM. Assay description: Binding affinity to recombinant human carbonic anhydrase 5a expressed in Escherichia coli expression system assessed as kinetic dissociation constant...
Ligand InfoPC cidPC sid
In DepthDetails ArticlePubMed
TargetCarbonic anhydrase 7(Homo sapiens (Human))
Vilnius University
Curated by ChEMBL
LigandPNGBDBM50504903(CHEMBL4454599)
Affinity DataKd:  0.0400nM. Assay description: Binding affinity to recombinant human carbonic anhydrase 7 expressed in Escherichia coli expression system assessed as kinetic dissociation constant ...
Ligand InfoPC cidPC sid
In DepthDetails ArticlePubMed
TargetCarbonic anhydrase 14(Homo sapiens (Human))
Vilnius University
Curated by ChEMBL
LigandPNGBDBM50504903(CHEMBL4454599)
Affinity DataKd:  0.100nM. Assay description: Binding affinity to recombinant human carbonic anhydrase 14 expressed in Escherichia coli expression system assessed as kinetic dissociation constant...
Ligand InfoPC cidPC sid
In DepthDetails ArticlePubMed
TargetCarbonic anhydrase 9(Homo sapiens (Human))
Vilnius University
Curated by ChEMBL
LigandPNGBDBM50504903(CHEMBL4454599)
Affinity DataKd:  0.25nM. Assay description: Binding affinity to recombinant human carbonic anhydrase 9 expressed in mammalian cell expression system assessed as observed dissociation constant f...
Ligand InfoPC cidPC sid
In DepthDetails ArticlePubMed