BDBM50505042 CHEMBL4440308
SMILES [H][C@]12[C@H](C)O[C@H](C)CN1c1c(CC22C(=O)NC(=O)NC2=O)cc2c(noc2c1F)N1[C@@H](C)CSC1=O
InChI Key InChIKey=KINLZPMGDGEPOC-ZESJGQACSA-N
Data  2 IC50
  Tab Delimited (TSV)   2D SDfile   Computed 3D by Vconf -m prep SDfile
Find this compound or compounds like it in BindingDB:
Activity Spreadsheet -- Enzyme Inhibition Constant Data from BindingDB
Found 2 hits for monomerid = 50505042
TargetDNA topoisomerase 2-alpha(Homo sapiens (Human))
Chinese Academy Of Sciences
Curated by ChEMBL
LigandPNGBDBM50505042(CHEMBL4440308)
Affinity DataIC50: >2.00E+5nM. Assay description: Inhibition of human topoisomerase-2alpha using catenated DNA as substrate after 30 mins by ethidium bromide-based gel electrophoresis
Ligand InfoPC cidPC sid
In DepthDetails ArticlePubMed
TargetDNA gyrase subunit A/B(Staphylococcus aureus)
Chinese Academy Of Sciences
Curated by ChEMBL
LigandPNGBDBM50505042(CHEMBL4440308)
Affinity DataIC50:  1.56E+4nM. Assay description: Inhibition of Staphylococcus aureus DNA gyrase supercoiling activity using relaxed pHOT-1 DNA as substrate after 60 mins by ethidium bromide-based ge...
Ligand InfoPC cidPC sid
In DepthDetails ArticlePubMed