BDBM50505875 CHEMBL4443551
SMILES Cc1ccc(cc1NC(=O)c1cnn(c1N)-c1ccccc1)C(=O)N[C@@H](CC1CCCCC1)C(N)=O
InChI Key InChIKey=FNFFGFDJILZSOU-QHCPKHFHSA-N
Data  2 IC50
  Tab Delimited (TSV)   2D SDfile   Computed 3D by Vconf -m prep SDfile
Find this compound or compounds like it in BindingDB:
Activity Spreadsheet -- Enzyme Inhibition Constant Data from BindingDB
Found 2 hits for monomerid = 50505875
TargetMitogen-activated protein kinase 11(Homo sapiens (Human))
Johann Wolfgang Goethe-University
Curated by ChEMBL
LigandPNGBDBM50505875(CHEMBL4443551)
Affinity DataIC50:  99nM. Assay description: Inhibition of recombinant human His-tagged P38beta MAPK (1 to 364 residues) expressed in Escherichia coli incubated for 60 mins by [gamma-33P]ATP bas...
Ligand InfoPC cidPC sid
In DepthDetails ArticlePubMed
TargetMitogen-activated protein kinase 14(Homo sapiens (Human))
Johann Wolfgang Goethe-University
Curated by ChEMBL
LigandPNGBDBM50505875(CHEMBL4443551)
Affinity DataIC50:  14nM. Assay description: Inhibition of recombinant human His-tagged P38 alpha MAPK (1 to 360 residues) expressed in Escherichia coli incubated for 60 mins by [gamma-33P]ATP b...
Ligand InfoPC cidPC sid
In DepthDetails ArticlePubMed