BDBM50506312 CHEMBL4519361
SMILES COc1ncc(cc1NS(C)(=O)=O)-c1cc2COCc2c(OC[C@H]2CN(C)CCO2)c1
InChI Key InChIKey=LAKNCFVOLBSBLJ-QGZVFWFLSA-N
Data  5 IC50
  Tab Delimited (TSV)   2D SDfile   Computed 3D by Vconf -m prep SDfile
Find this compound or compounds like it in BindingDB:
Activity Spreadsheet -- Enzyme Inhibition Constant Data from BindingDB
Found 5 hits for monomerid = 50506312
LigandPNGBDBM50506312(CHEMBL4519361)
Affinity DataIC50:  10nM. Assay description: Inhibition of recombinant human full-length N-terminal His6-tagged p110delta/human recombinant full-length untagged p85alpha expressed in baculovirus...
Ligand InfoPC cidPC sid
In DepthDetails ArticlePubMed
LigandPNGBDBM50506312(CHEMBL4519361)
Affinity DataIC50:  631nM. Assay description: Inhibition of recombinant human full-length N-terminal His6-tagged p120gamma expressed in baculovirus infected Sf21 insect cells using PIP2 as substr...
Ligand InfoPC cidPC sid
In DepthDetails ArticlePubMed
LigandPNGBDBM50506312(CHEMBL4519361)
Affinity DataIC50:  501nM. Assay description: Inhibition of recombinant human full-length N-terminal His6-tagged p110alpha/human recombinant full-length untagged p85alpha expressed in baculovirus...
Ligand InfoPC cidPC sid
In DepthDetails ArticlePubMed
LigandPNGBDBM50506312(CHEMBL4519361)
Affinity DataIC50:  251nM. Assay description: Inhibition of PI3Kdelta in human whole blood assessed as reduction in cytostim-stimulated IFNgamma production preincubated for 1 hr followed by cytos...
Ligand InfoPC cidPC sid
In DepthDetails ArticlePubMed
LigandPNGBDBM50506312(CHEMBL4519361)
Affinity DataIC50:  794nM. Assay description: Inhibition of recombinant human full-length N-terminal His6-tagged p110beta/human recombinant full-length untagged p85alpha expressed in baculovirus ...
Ligand InfoPC cidPC sid
In DepthDetails ArticlePubMed