BDBM50506323 CHEMBL4556087
SMILES COc1ncc(cc1NS(C)(=O)=O)-c1cc2COCc2c(OCCN2CCC(CC2)C(C)(C)O)c1
InChI Key InChIKey=YTBODSVQSOILIJ-UHFFFAOYSA-N
Data  5 IC50  5 Kd
PDB links: 1 PDB ID matches this monomer.
  Tab Delimited (TSV)   2D SDfile   Computed 3D by Vconf -m prep SDfile
Find this compound or compounds like it in BindingDB:
Activity Spreadsheet -- Enzyme Inhibition Constant Data from BindingDB
Found 10 hits for monomerid = 50506323
LigandPNGBDBM50506323(CHEMBL4556087)
Affinity DataIC50:  631nM. Assay description: Inhibition of recombinant human full-length N-terminal His6-tagged p110beta/human recombinant full-length untagged p85alpha expressed in baculovirus ...
Ligand InfoPC cidPC sidPDB
In DepthDetails ArticlePubMed
LigandPNGBDBM50506323(CHEMBL4556087)
Affinity DataKd:  50nM. Assay description: Binding affinity to PI3Kbeta in human HL60 cell extract measured after 2 hrs by kinobeads based pull down assay
Ligand InfoPC cidPC sidPDB
In DepthDetails ArticlePubMed
LigandPNGBDBM50506323(CHEMBL4556087)
Affinity DataKd:  2.51E+3nM. Assay description: Binding affinity to PI3Kgamma in human HL60 cell extract measured after 2 hrs by kinobeads based pull down assay
Ligand InfoPC cidPC sidPDB
In DepthDetails ArticlePubMed
LigandPNGBDBM50506323(CHEMBL4556087)
Affinity DataIC50:  4nM. Assay description: Inhibition of recombinant human full-length N-terminal His6-tagged p110delta/human recombinant full-length untagged p85alpha expressed in baculovirus...
Ligand InfoPC cidPC sidPDB
LigandPNGBDBM50506323(CHEMBL4556087)
Affinity DataIC50:  32nM. Assay description: Inhibition of PI3Kdelta in human whole blood assessed as reduction in cytostim-stimulated IFNgamma production preincubated for 1 hr followed by cytos...
Ligand InfoPC cidPC sidPDB
LigandPNGBDBM50506323(CHEMBL4556087)
Affinity DataIC50:  2.00E+3nM. Assay description: Inhibition of recombinant human full-length N-terminal His6-tagged p110alpha/human recombinant full-length untagged p85alpha expressed in baculovirus...
Ligand InfoPC cidPC sidPDB
In DepthDetails ArticlePubMed
LigandPNGBDBM50506323(CHEMBL4556087)
Affinity DataKd:  316nM. Assay description: Binding affinity to PI3Kalpha in human HL60 cell extract measured after 2 hrs by kinobeads based pull down assay
Ligand InfoPC cidPC sidPDB
In DepthDetails ArticlePubMed
LigandPNGBDBM50506323(CHEMBL4556087)
Affinity DataKd:  0.251nM. Assay description: Binding affinity to PI3Kdelta in human HL60 cell extract measured after 2 hrs by kinobeads based pull down assay
Ligand InfoPC cidPC sidPDB
LigandPNGBDBM50506323(CHEMBL4556087)
Affinity DataIC50:  3.98E+3nM. Assay description: Inhibition of recombinant human full-length N-terminal His6-tagged p120gamma expressed in baculovirus infected Sf21 insect cells using PIP2 as substr...
Ligand InfoPC cidPC sidPDB
In DepthDetails ArticlePubMed
TargetPhosphatidylinositol 3-kinase catalytic subunit type 3(Homo sapiens (Human))
Glaxosmithkline
Curated by ChEMBL
LigandPNGBDBM50506323(CHEMBL4556087)
Affinity DataKd:  2nM. Assay description: Binding affinity to VPS34 in human HL60 cell extract measured after 2 hrs by kinobeads based pull down assay
Ligand InfoPC cidPC sidPDB
In DepthDetails ArticlePubMed