BDBM50506342 CHEMBL4448491
SMILES COCCS(=O)(=O)Nc1cc(cnc1OC)-c1cc2COCc2c(OC[C@@H]2CN(CCO2)C2COC2)c1
InChI Key InChIKey=ZWPJBXLFZFLGMV-NRFANRHFSA-N
Data  5 IC50
  Tab Delimited (TSV)   2D SDfile   Computed 3D by Vconf -m prep SDfile
Find this compound or compounds like it in BindingDB:
Activity Spreadsheet -- Enzyme Inhibition Constant Data from BindingDB
Found 5 hits for monomerid = 50506342
LigandPNGBDBM50506342(CHEMBL4448491)
Affinity DataIC50:  794nM. Assay description: Inhibition of recombinant human full-length N-terminal His6-tagged p110beta/human recombinant full-length untagged p85alpha expressed in baculovirus ...
Ligand InfoPC cidPC sid
In DepthDetails ArticlePubMed
LigandPNGBDBM50506342(CHEMBL4448491)
Affinity DataIC50:  316nM. Assay description: Inhibition of recombinant human full-length N-terminal His6-tagged p120gamma expressed in baculovirus infected Sf21 insect cells using PIP2 as substr...
Ligand InfoPC cidPC sid
In DepthDetails ArticlePubMed
LigandPNGBDBM50506342(CHEMBL4448491)
Affinity DataIC50:  79nM. Assay description: Inhibition of PI3Kdelta in human whole blood assessed as reduction in cytostim-stimulated IFNgamma production preincubated for 1 hr followed by cytos...
Ligand InfoPC cidPC sid
In DepthDetails ArticlePubMed
LigandPNGBDBM50506342(CHEMBL4448491)
Affinity DataIC50:  16nM. Assay description: Inhibition of recombinant human full-length N-terminal His6-tagged p110delta/human recombinant full-length untagged p85alpha expressed in baculovirus...
Ligand InfoPC cidPC sid
In DepthDetails ArticlePubMed
LigandPNGBDBM50506342(CHEMBL4448491)
Affinity DataIC50:  1.59E+3nM. Assay description: Inhibition of recombinant human full-length N-terminal His6-tagged p110alpha/human recombinant full-length untagged p85alpha expressed in baculovirus...
Ligand InfoPC cidPC sid
In DepthDetails ArticlePubMed