BDBM50506382 CHEMBL4449592
SMILES CNC(=O)Nc1ccc2c(CC[C@@]22OC(=O)N(CC(=O)N3Cc4ccccc4CC[C@H]3C(F)(F)F)C2=O)c1
InChI Key InChIKey=IBPGRSASCGUKNK-NBGIEHNGSA-N
Data  1 IC50
  Tab Delimited (TSV)   2D SDfile   Computed 3D by Vconf -m prep SDfile
Find this compound or compounds like it in BindingDB:
Activity Spreadsheet -- Enzyme Inhibition Constant Data from BindingDB
Found 1 hit for monomerid = 50506382
TargetHistone acetyltransferase p300(Homo sapiens (Human))
Chinese Academy Of Sciences
Curated by ChEMBL
LigandPNGBDBM50506382(CHEMBL4449592)
Affinity DataIC50:  2.60nM. Assay description: Inhibition of p300 (unknown origin) using histone H3 (1 to 21 residues) as substrate preincubated for 15 mins followed by substrate and [3H]acetyl-Co...
Ligand InfoPC cidPC sid
In DepthDetails ArticlePubMed