BDBM50506669 CHEMBL4459307
SMILES OC(=O)CN1C(=S)S\C(=C/c2cccc(OCCc3ccccc3)c2)C1=O
InChI Key InChIKey=STKZJPQZNBVHCZ-ATVHPVEESA-N
Data  4 KI  2 IC50
  Tab Delimited (TSV)   2D SDfile   Computed 3D by Vconf -m prep SDfile
Find this compound or compounds like it in BindingDB:
Activity Spreadsheet -- Enzyme Inhibition Constant Data from BindingDB
Found 6 hits for monomerid = 50506669
TargetAldo-keto reductase family 1 member B1(Homo sapiens (Human))
University Of Messina
Curated by ChEMBL
LigandPNGBDBM50506669(CHEMBL4459307)
Affinity DataKi:  6.20nM. Assay description: Uncompetitive inhibition of human recombinant aldose reductase expressed in Escherichia coli BL21(DE3)pLysS assessed as dissociation constant of enzy...
Ligand InfoPC cidPC sid
In DepthDetails ArticlePubMed
TargetAldo-keto reductase family 1 member B1(Homo sapiens (Human))
University Of Messina
Curated by ChEMBL
LigandPNGBDBM50506669(CHEMBL4459307)
Affinity DataKi: >300nM. Assay description: Uncompetitive inhibition of human recombinant aldose reductase expressed in Escherichia coli BL21(DE3)pLysS assessed as dissociation constant of enzy...
Ligand InfoPC cidPC sid
In DepthDetails ArticlePubMed
TargetTyrosine-protein phosphatase non-receptor type 1(Homo sapiens (Human))
University Of Messina
Curated by ChEMBL
LigandPNGBDBM50506669(CHEMBL4459307)
Affinity DataKi:  1.20E+4nM. Assay description: Non-competitive inhibition of human full-length GST-fused PTP1B expressed in bacterial expression system assessed as dissociation constant of enzyme-...
Ligand InfoPC cidPC sid
In DepthDetails ArticlePubMed
TargetTyrosine-protein phosphatase non-receptor type 1(Homo sapiens (Human))
University Of Messina
Curated by ChEMBL
LigandPNGBDBM50506669(CHEMBL4459307)
Affinity DataKi:  1.20E+4nM. Assay description: Non-competitive inhibition of human full-length GST-fused PTP1B expressed in bacterial expression system assessed as dissociation constant of enzyme-...
Ligand InfoPC cidPC sid
In DepthDetails ArticlePubMed
TargetAldo-keto reductase family 1 member B1(Homo sapiens (Human))
University Of Messina
Curated by ChEMBL
LigandPNGBDBM50506669(CHEMBL4459307)
Affinity DataIC50:  56nM. Assay description: Inhibition of human recombinant aldose reductase expressed in Escherichia coli BL21 (DE3) pLysS assessed as reduction in NADPH oxidation using L-idos...
Ligand InfoPC cidPC sid
In DepthDetails ArticlePubMed
TargetTyrosine-protein phosphatase non-receptor type 1(Homo sapiens (Human))
University Of Messina
Curated by ChEMBL
LigandPNGBDBM50506669(CHEMBL4459307)
Affinity DataIC50:  3.25E+4nM. Assay description: Inhibition of human full-length GST-fused PTP1B expressed in bacterial expression system using pNPP as substrate
Ligand InfoPC cidPC sid
In DepthDetails ArticlePubMed