BDBM50506722 CHEMBL4439862
SMILES Cc1cccc2nc3\C(=N/O)c4ccccc4-c3nc12
InChI Key InChIKey=ZJWZDMQTDMVQQB-CYVLTUHYSA-N
Data  2 IC50  3 Kd
  Tab Delimited (TSV)   2D SDfile   Computed 3D by Vconf -m prep SDfile
Find this compound or compounds like it in BindingDB:
Activity Spreadsheet -- Enzyme Inhibition Constant Data from BindingDB
Found 5 hits for monomerid = 50506722
TargetMitogen-activated protein kinase 9(Homo sapiens (Human))
Montana State University
Curated by ChEMBL
LigandPNGBDBM50506722(CHEMBL4439862)
Affinity DataKd:  2.50E+3nM. Assay description: Binding affinity to human full-length JNK2 (M1 to Q382 residues) expressed in HEK293 cells measured after 1 hr by Kinomescan method
Ligand InfoPC cidPC sid
In DepthDetails ArticlePubMed
TargetMitogen-activated protein kinase 10/8/9(Homo sapiens (Human))
Montana State University
Curated by ChEMBL
LigandPNGBDBM50506722(CHEMBL4439862)
Affinity DataIC50:  3.00E+3nM. Assay description: Inhibition of JNK in human THP1-Blue cells assessed as reduction in LPS-induced NFkappaB/AP1 activation preincubated for 30 mins followed by LPS-stim...
Ligand InfoPC cidPC sid
In DepthDetails ArticlePubMed
TargetMitogen-activated protein kinase 10/8/9(Homo sapiens (Human))
Montana State University
Curated by ChEMBL
LigandPNGBDBM50506722(CHEMBL4439862)
Affinity DataIC50:  500nM. Assay description: Inhibition of JNK in human MONO-MAC-6 cells assessed as reduction in LPS-induced IL6 production preincubated for 30 mins followed by LPS-stimulation ...
Ligand InfoPC cidPC sid
In DepthDetails ArticlePubMed
TargetMitogen-activated protein kinase 10(Homo sapiens (Human))
Montana State University
Curated by ChEMBL
LigandPNGBDBM50506722(CHEMBL4439862)
Affinity DataKd:  6.00E+3nM. Assay description: Binding affinity to human partial length JNK3 (V28 to Q422 residues) expressed in HEK293 cells measured after 1 hr by Kinomescan method
Ligand InfoPC cidPC sid
In DepthDetails ArticlePubMed
TargetMitogen-activated protein kinase 8(Homo sapiens (Human))
Montana State University
Curated by ChEMBL
LigandPNGBDBM50506722(CHEMBL4439862)
Affinity DataKd:  3.30E+3nM. Assay description: Binding affinity to human full-length JNK1 (M1 to Q384 residues) expressed in HEK293 cells measured after 1 hr by Kinomescan method
Ligand InfoPC cidPC sid
In DepthDetails ArticlePubMed