BDBM50509193 CHEMBL4474044
SMILES Brc1ccc(Cn2cc(CCC(=O)Nc3nnc(CCCCc4nnc(NC(=O)Cc5ccccc5)s4)s3)nn2)cc1
InChI Key InChIKey=YPDWMQWFDORYCF-UHFFFAOYSA-N
Data  2 IC50
  Tab Delimited (TSV)   2D SDfile   Computed 3D by Vconf -m prep SDfile
Find this compound or compounds like it in BindingDB:
Activity Spreadsheet -- Enzyme Inhibition Constant Data from BindingDB
Found 2 hits for monomerid = 50509193
TargetGlutaminase kidney isoform, mitochondrial(Homo sapiens (Human))
China Pharmaceutical University
Curated by ChEMBL
LigandPNGBDBM50509193(CHEMBL4474044)
Affinity DataIC50:  980nM. Assay description: Inhibition of human GLS1 expressed in Escherichia coli strain BL21 (DE3)pLysS pre-incubated for 10 mins before glutamine addition and measured after ...
Ligand InfoPC cidPC sid
In DepthDetails ArticlePubMed
TargetGlutaminase kidney isoform, mitochondrial(Homo sapiens (Human))
China Pharmaceutical University
Curated by ChEMBL
LigandPNGBDBM50509193(CHEMBL4474044)
Affinity DataIC50:  1.08E+3nM. Assay description: Inhibition of N-[2-[(3',6'-dihydroxy-1-oxo-spiro[isobenzofuran-3,9'-xanthene]-5-yl)carbamothioylamino]ethyl]-N'-[6-[4-[5-[[2-(2-pyridyl)acetyl]amino]...
Ligand InfoPC cidPC sid
In DepthDetails ArticlePubMed