BDBM50511282 CHEMBL4592427
SMILES O=C(NCCCCc1ccccc1)n1c2cnccc2oc1=O
InChI Key InChIKey=HYPXTILUYDZQEW-UHFFFAOYSA-N
Data  1 IC50
  Tab Delimited (TSV)   2D SDfile   Computed 3D by Vconf -m prep SDfile
Find this compound or compounds like it in BindingDB:
Activity Spreadsheet -- Enzyme Inhibition Constant Data from BindingDB
Found 1 hit for monomerid = 50511282
TargetAcid ceramidase(Homo sapiens (Human))
University Of Illinois At Chicago
Curated by ChEMBL
LigandPNGBDBM50511282(CHEMBL4592427)
Affinity DataIC50:  6nM. Assay description: Inhibition of human acid ceramidase expressed in HEK293 cells using Rbm14-12 as substrate preincubated for 10 mins followed by substrate addition and...
Ligand InfoPC cidPC sid
In DepthDetails ArticlePubMed