BDBM50511399 CHEMBL4542463
SMILES O=C(Nc1n[nH]c2cc(ccc12)-c1cccc(CNS(=O)(=O)CC2CC2)c1)C1CC1
InChI Key InChIKey=DPCPNRYPXUUJCP-UHFFFAOYSA-N
Data  4 KI  4 IC50
  Tab Delimited (TSV)   2D SDfile   Computed 3D by Vconf -m prep SDfile
Find this compound or compounds like it in BindingDB:
Activity Spreadsheet -- Enzyme Inhibition Constant Data from BindingDB
Found 8 hits for monomerid = 50511399
TargetAP2-associated protein kinase 1(Homo sapiens (Human))
University Of North Carolina At Chapel Hill (Unc-Ch)
Curated by ChEMBL
LigandPNGBDBM50511399(CHEMBL4542463)
Affinity DataKi:  22nM. Assay description: Displacement of Alexafluor labelled kinase tracer236 from biotinylated C-terminal Avi-tagged AAK1 kinase domain (31 to 396 residues) (unknown origin)...
Ligand InfoPC cidPC sid
In DepthDetails ArticlePubMed
TargetBMP-2-inducible protein kinase(Homo sapiens (Human))
University Of North Carolina At Chapel Hill (Unc-Ch)
Curated by ChEMBL
LigandPNGBDBM50511399(CHEMBL4542463)
Affinity DataKi:  37nM. Assay description: Displacement of Alexafluor labelled kinase tracer236 from biotinylated C-terminal Avi-tagged BMP2K kinase domain (38 to 345 residues) (unknown origin...
Ligand InfoPC cidPC sid
In DepthDetails ArticlePubMed
TargetSerine/threonine-protein kinase 16(Homo sapiens (Human))
University Of North Carolina At Chapel Hill (Unc-Ch)
Curated by ChEMBL
LigandPNGBDBM50511399(CHEMBL4542463)
Affinity DataKi:  150nM. Assay description: Displacement of Alexafluor labelled kinase tracer236 from biotinylated C-terminal Avi-tagged STK16 kinase domain (13 to 305 residues) (unknown origin...
Ligand InfoPC cidPC sid
In DepthDetails ArticlePubMed
TargetCyclin-G-associated kinase(Homo sapiens (Human))
University Of North Carolina At Chapel Hill (Unc-Ch)
Curated by ChEMBL
LigandPNGBDBM50511399(CHEMBL4542463)
Affinity DataKi:  3.20E+3nM. Assay description: Displacement of Alexafluor labelled kinase tracer236 from biotinylated C-terminal Avi-tagged GAK kinase domain (12 to 347 residues) (unknown origin) ...
Ligand InfoPC cidPC sid
In DepthDetails ArticlePubMed
TargetSerine/threonine-protein kinase 16(Homo sapiens (Human))
University Of North Carolina At Chapel Hill (Unc-Ch)
Curated by ChEMBL
LigandPNGBDBM50511399(CHEMBL4542463)
Affinity DataIC50: >1.00E+4nM. Assay description: Inhibition of tracer K5 binding to N-terminal nano luciferase-fused STK16 (unknown origin) expressed in HEK293 cells incubated for 2 hrs followed by ...
Ligand InfoPC cidPC sid
In DepthDetails ArticlePubMed
TargetCyclin-G-associated kinase(Homo sapiens (Human))
University Of North Carolina At Chapel Hill (Unc-Ch)
Curated by ChEMBL
LigandPNGBDBM50511399(CHEMBL4542463)
Affinity DataIC50: >1.00E+4nM. Assay description: Inhibition of tracer K5 binding to N-terminal nano luciferase-fused GAK (unknown origin) expressed in HEK293 cells incubated for 2 hrs followed by Na...
Ligand InfoPC cidPC sid
In DepthDetails ArticlePubMed
TargetBMP-2-inducible protein kinase(Homo sapiens (Human))
University Of North Carolina At Chapel Hill (Unc-Ch)
Curated by ChEMBL
LigandPNGBDBM50511399(CHEMBL4542463)
Affinity DataIC50:  2.74E+3nM. Assay description: Inhibition of tracer K5 binding to N-terminal nano luciferase-fused BMP2K (unknown origin) expressed in HEK293 cells incubated for 2 hrs followed by ...
Ligand InfoPC cidPC sid
In DepthDetails ArticlePubMed
TargetAP2-associated protein kinase 1(Homo sapiens (Human))
University Of North Carolina At Chapel Hill (Unc-Ch)
Curated by ChEMBL
LigandPNGBDBM50511399(CHEMBL4542463)
Affinity DataIC50:  1.26E+3nM. Assay description: Inhibition of tracer K5 binding to N-terminal nano luciferase-fused AAK1 (unknown origin) expressed in HEK293 cells incubated for 2 hrs followed by N...
Ligand InfoPC cidPC sid
In DepthDetails ArticlePubMed