BDBM50513040 CHEMBL4593226
SMILES CC(C)(C)C(=O)N1N=CCC1c1cc(F)cc(F)c1
InChI Key InChIKey=OQGZHBKSNKEBFG-UHFFFAOYSA-N
Data  3 IC50
  Tab Delimited (TSV)   2D SDfile   Computed 3D by Vconf -m prep SDfile
Find this compound or compounds like it in BindingDB:
Activity Spreadsheet -- Enzyme Inhibition Constant Data from BindingDB
Found 3 hits for monomerid = 50513040
TargetReceptor-interacting serine/threonine-protein kinase 1(Homo sapiens (Human))
Glaxosmithkline
Curated by ChEMBL
LigandPNGBDBM50513040(CHEMBL4593226)
Affinity DataIC50:  6.40nM. Assay description: Inhibition of RIP1 in human U937 cells assessed as reduction in TNFalpha/QVD-Oph-induced necroptosis measured after 24 hrs by cell titer-glo luminesc...
Ligand InfoPC cidPC sid
In DepthDetails ArticlePubMed
TargetReceptor-interacting serine/threonine-protein kinase 1(Homo sapiens (Human))
Glaxosmithkline
Curated by ChEMBL
LigandPNGBDBM50513040(CHEMBL4593226)
Affinity DataIC50:  1.30nM. Assay description: Inhibition of human GST/His-tagged RIP1 (1 to 375 residues) expressed in baculovirus expression system assessed as reduction in autophosphorylation m...
Ligand InfoPC cidPC sid
In DepthDetails ArticlePubMed
TargetReceptor-interacting serine/threonine-protein kinase 1(Homo sapiens (Human))
Glaxosmithkline
Curated by ChEMBL
LigandPNGBDBM50513040(CHEMBL4593226)
Affinity DataIC50:  10nM. Assay description: Inhibition of (14-(2-{[3-({2-{[4-(cyanomethyl)phenyl]amino}-6-[(5-cyclopropyl-1H-pyrazol-3-yl)amino]-4-pyrimidinyl}amino)propyl]amino}-2-oxoethyl)-16...
Ligand InfoPC cidPC sid
In DepthDetails ArticlePubMed