BDBM50515478 CHEMBL4455311
SMILES OC(=O)c1cc(NC(=O)c2ccc(cc2)C#N)cc(c1)-c1ccc(cc1)C1CCNCC1
InChI Key InChIKey=TXUCGLJAJYUWIX-UHFFFAOYSA-N
Data  1 IC50
  Tab Delimited (TSV)   2D SDfile   Computed 3D by Vconf -m prep SDfile
Find this compound or compounds like it in BindingDB:
Activity Spreadsheet -- Enzyme Inhibition Constant Data from BindingDB
Found 1 hit for monomerid = 50515478
TargetP2Y purinoceptor 14(Homo sapiens (Human))
China Pharmaceutical University
Curated by ChEMBL
LigandPNGBDBM50515478(CHEMBL4455311)
Affinity DataIC50:  4.5nM. Assay description: Antagonist activity at human P2Y14R stably expressed in human forskolin treated THP1 cells assessed as reduction in P2Y14R agonist UDPG-induced inhib...
Ligand InfoPC cidPC sid
In DepthDetails ArticlePubMed