BDBM50515563 CHEMBL4436769
SMILES [#6]-c1ccccc1[Te;v2][#6]-[#6](-[#8])-[#6]-[#8]-c1ccc(cc1)S([#7])(=O)=O
InChI Key InChIKey=LUBRMGCZSLCRGL-UHFFFAOYSA-N
Data  5 KI
  Tab Delimited (TSV)   2D SDfile   Computed 3D by Vconf -m prep SDfile
Find this compound or compounds like it in BindingDB:
Activity Spreadsheet -- Enzyme Inhibition Constant Data from BindingDB
Found 5 hits for monomerid = 50515563
TargetCarbonic anhydrase 2(Homo sapiens (Human))
University Of Florence
Curated by ChEMBL
LigandPNGBDBM50515563(CHEMBL4436769)
Affinity DataKi:  0.640nM. Assay description: Inhibition of recombinant human carbonic anhydrase 2 preincubated for 15 mins by phenol red dye based stopped flow CO2 hydration assay
Ligand InfoPC cidPC sid
In DepthDetails ArticlePubMed
TargetCarbonic anhydrase 7(Homo sapiens (Human))
University Of Florence
Curated by ChEMBL
LigandPNGBDBM50515563(CHEMBL4436769)
Affinity DataKi:  0.720nM. Assay description: Inhibition of recombinant human carbonic anhydrase 7 preincubated for 15 mins by phenol red dye based stopped flow CO2 hydration assay
Ligand InfoPC cidPC sid
In DepthDetails ArticlePubMed
TargetCarbonic anhydrase 9(Homo sapiens (Human))
University Of Florence
Curated by ChEMBL
LigandPNGBDBM50515563(CHEMBL4436769)
Affinity DataKi:  9.5nM. Assay description: Inhibition of recombinant human carbonic anhydrase 9 preincubated for 15 mins by phenol red dye based stopped flow CO2 hydration assay
Ligand InfoPC cidPC sid
In DepthDetails ArticlePubMed
TargetCarbonic anhydrase 1(Homo sapiens (Human))
University Of Florence
Curated by ChEMBL
LigandPNGBDBM50515563(CHEMBL4436769)
Affinity DataKi:  37nM. Assay description: Inhibition of recombinant human carbonic anhydrase 1 preincubated for 15 mins by phenol red dye based stopped flow CO2 hydration assay
Ligand InfoPC cidPC sid
In DepthDetails ArticlePubMed
TargetCarbonic anhydrase 4(Homo sapiens (Human))
University Of Florence
Curated by ChEMBL
LigandPNGBDBM50515563(CHEMBL4436769)
Affinity DataKi:  192nM. Assay description: Inhibition of recombinant human carbonic anhydrase 4 preincubated for 15 mins by phenol red dye based stopped flow CO2 hydration assay
Ligand InfoPC cidPC sid
In DepthDetails ArticlePubMed