BDBM50516697 CHEMBL4302450
SMILES C\C(CO)=C/CCP(O)(=O)OP(O)(O)=O
InChI Key InChIKey=YYYUHBYKZCBOPY-ZZXKWVIFSA-N
Data  2 IC50  2 EC50
PDB links: 1 PDB ID matches this monomer.
  Tab Delimited (TSV)   2D SDfile   Computed 3D by Vconf -m prep SDfile
Find this compound or compounds like it in BindingDB:
Activity Spreadsheet -- Enzyme Inhibition Constant Data from BindingDB
Found 4 hits for monomerid = 50516697
TargetButyrophilin subfamily 3 member A1(Homo sapiens (Human))
Western Michigan University
Curated by ChEMBL
LigandPNGBDBM50516697(CHEMBL4302450)
Affinity DataEC50:  86nM. Assay description: Activation of BTN3A1 in human PBMC-derived Vgamma9/Vdelta2 T cells assessed as induction of IL2-stimulated cell proliferation by measuring increase i...
TargetButyrophilin subfamily 3 member A1(Homo sapiens (Human))
Western Michigan University
Curated by ChEMBL
LigandPNGBDBM50516697(CHEMBL4302450)
Affinity DataIC50:  7.87E+3nM. Assay description: Displacement of GDP-BODIPY from C-terminal 6His-tagged BTN3A1 B30.2 domain (unknown origin) expressed in Escherichia coli BL21 (DE) measured after 60...
TargetButyrophilin subfamily 3 member A1(Homo sapiens (Human))
Western Michigan University
Curated by ChEMBL
LigandPNGBDBM50516697(CHEMBL4302450)
Affinity DataIC50:  7.87E+3nM. Assay description: Displacement of GDP-BODIPY from C-terminal 6His-tagged BTN3A1 full interaction domain (unknown origin) expressed in Escherichia coli BL21 (DE) measur...
TargetButyrophilin subfamily 3 member A1(Homo sapiens (Human))
Western Michigan University
Curated by ChEMBL
LigandPNGBDBM50516697(CHEMBL4302450)
Affinity DataEC50:  2nM. Assay description: Activation of BTN3A1 in human PBMC-derived Vgamma9/Vdelta2 T cells assessed as induction of IL2-stimulated IFNgamma production measured after 48 hrs ...