BDBM50520494 CHEMBL4540592
SMILES CC[C@H](C)[C@H](NC(=O)[C@H](CCCNC(N)=N)NC(=O)[C@H](CCCNC(N)=N)NC(=O)[C@H](C)NC(=O)[C@H](Cc1ccc(O)cc1)NC(=O)[C@H](CCCNC(N)=N)NC(=O)[C@H](CCCNC(N)=N)NC(=O)[C@H](CCCNC(N)=N)NC(=O)[C@H](CCCNC(N)=N)NC(=O)[C@H](CC(O)=O)NC(=O)[C@H](Cc1ccc(O)cc1)NC(=O)[C@@H]1CCCN1C(=O)[C@H](CO)NC(=O)[C@H](CCCNC(N)=N)NC(=O)[C@H](CO)NC(=O)[C@H](Cc1ccc(O)cc1)NC(=O)[C@H](CCCNC(N)=N)NC(=O)CNC(=O)[C@H](CO)NC(=O)[C@H](CO)NC(=O)[C@H](CCCNC(N)=N)NC(=O)[C@H](CO)NC(=O)[C@@H](N)[C@@H](C)O)C(=O)N[C@@H]([C@@H](C)O)C(=O)N[C@@H](CC(O)=O)C(=O)N[C@@H](C)C(=O)N[C@@H](C)C(=O)N[C@@H](C(C)C)C(O)=O
InChI Key InChIKey=IIBXFUOKWUWBBF-JHKJEGEHSA-N
Data  5 IC50
  Tab Delimited (TSV)   2D SDfile   Computed 3D by Vconf -m prep SDfile
Find this compound or compounds like it in BindingDB:
Activity Spreadsheet -- Enzyme Inhibition Constant Data from BindingDB
Found 5 hits for monomerid = 50520494
TargetNeuronal acetylcholine receptor subunit alpha-3/beta-2(Rattus norvegicus (Rat))
Hainan University
Curated by ChEMBL
LigandPNGBDBM50520494(CHEMBL4540592)
Affinity DataIC50:  3.71E+3nM. Assay description: Antagonist activity at rat alpha3beta2 nAChR expressed in Xenopus laevis oocytes assessed as inhibition of Ach-induced response at -70 mV holding pot...
Ligand InfoPC cidPC sid
In DepthDetails ArticlePubMed
TargetNeuronal acetylcholine receptor subunit alpha-3/beta-4(Rattus norvegicus (Rat))
Hainan University
Curated by ChEMBL
LigandPNGBDBM50520494(CHEMBL4540592)
Affinity DataIC50:  5.75E+3nM. Assay description: Antagonist activity at rat alpha3beta4 nAChR expressed in Xenopus laevis oocytes assessed as inhibition of Ach-induced response at -70 mV holding pot...
Ligand InfoPC cidPC sid
In DepthDetails ArticlePubMed
TargetNeuronal acetylcholine receptor subunit alpha-2/beta-2(Rattus norvegicus (Rat))
Hainan University
Curated by ChEMBL
LigandPNGBDBM50520494(CHEMBL4540592)
Affinity DataIC50:  4.90E+3nM. Assay description: Antagonist activity at rat alpha2beta2 nAChR expressed in Xenopus laevis oocytes assessed as inhibition of Ach-induced response at -70 mV holding pot...
Ligand InfoPC cidPC sid
In DepthDetails ArticlePubMed
TargetNicotinic acetylcholine receptor alpha9/alpha10(RAT)
Hainan University
Curated by ChEMBL
LigandPNGBDBM50520494(CHEMBL4540592)
Affinity DataIC50:  13nM. Assay description: Antagonist activity at rat alpha9alpha10 nAChR expressed in Xenopus laevis oocytes assessed as inhibition of Ach-induced response at -70 mV holding p...
Ligand InfoPC cidPC sid
In DepthDetails ArticlePubMed
TargetNeuronal acetylcholine receptor subunit alpha-7(Rattus norvegicus (Rat))
Hainan University
Curated by ChEMBL
LigandPNGBDBM50520494(CHEMBL4540592)
Affinity DataIC50:  4.11E+3nM. Assay description: Antagonist activity at rat alpha7 nAChR expressed in Xenopus laevis oocytes assessed as inhibition of Ach-induced response at -70 mV holding potentia...
Ligand InfoPC cidPC sid
In DepthDetails ArticlePubMed