BDBM50521311 CHEMBL4591391::US10815213, Example 150
SMILES NC(=O)c1c(N)n(nc1-c1ccc(Oc2ccc(F)cc2F)cc1)[C@@H]1CCCN(C1)C(=O)C(F)=C
InChI Key InChIKey=HDJDUEDKKGDEPE-MRXNPFEDSA-N
Data  5 IC50
  Tab Delimited (TSV)   2D SDfile   Computed 3D by Vconf -m prep SDfile
Find this compound or compounds like it in BindingDB:
Activity Spreadsheet -- Enzyme Inhibition Constant Data from BindingDB
Found 5 hits for monomerid = 50521311
TargetTyrosine-protein kinase BTK(Homo sapiens (Human))
Pfizer
Curated by ChEMBL
LigandPNGBDBM50521311(CHEMBL4591391 | US10815213, Example 150)
Affinity DataIC50:  5.30nM. Assay description: Inhibition of full-length human His-tagged BTK expressed in baculovirus expression system using FAM-Srctide peptide as substrate preincubated for 1 h...
Ligand InfoPC cidPC sid
In DepthDetails ArticlePubMed
TargetTyrosine-protein kinase BTK(Homo sapiens (Human))
Pfizer
Curated by ChEMBL
LigandPNGBDBM50521311(CHEMBL4591391 | US10815213, Example 150)
Affinity DataIC50:  170nM. Assay description: Inhibition of full-length human C-terminal His6-tagged BTK C481S mutant expressed in Sf9 insect cells using FAM-Srctide peptide as substrate preincub...
Ligand InfoPC cidPC sid
In DepthDetails ArticlePubMed
TargetTyrosine-protein kinase BTK(Homo sapiens (Human))
Pfizer
Curated by ChEMBL
LigandPNGBDBM50521311(CHEMBL4591391 | US10815213, Example 150)
Affinity DataIC50:  5.30nM. Assay description: BTK: TR-FRET LanthaScreen assays were performed by incubating a dilution series of inhibitor concentrations with 50 μM ATP, 100 nM FAM-Srctide p...
Ligand InfoPC cidPC sid
In DepthDetails US Patent
TargetEpidermal growth factor receptor(Homo sapiens (Human))
Pfizer
Curated by ChEMBL
LigandPNGBDBM50521311(CHEMBL4591391 | US10815213, Example 150)
Affinity DataIC50:  570nM. Assay description: Inhibition of human EGFR cytoplasmic domain expressed in baculovirus expression system using FITC-C6-KKAEEEEYFELVAKK-NH2 as substrate preincubated fo...
Ligand InfoPC cidPC sid
In DepthDetails ArticlePubMed
TargetProto-oncogene tyrosine-protein kinase Src(Homo sapiens (Human))
Pfizer
Curated by ChEMBL
LigandPNGBDBM50521311(CHEMBL4591391 | US10815213, Example 150)
Affinity DataIC50:  6.48E+3nM. Assay description: Inhibition of full-length recombinant human C-terminal His-tagged SRC cytoplasmic domain expressed in baculovirus expression system using FAM-Srctide...
Ligand InfoPC cidPC sid
In DepthDetails ArticlePubMed