BDBM50521760 CHEMBL4447294
SMILES Cc1c[nH]c(=O)c2sc(C(=O)NCc3ccc(cc3)S(=O)(=O)C(F)(F)F)c(N)c12
InChI Key InChIKey=GXJNAOPYNVUKDT-UHFFFAOYSA-N
Data  1 EC50
  Tab Delimited (TSV)   2D SDfile   Computed 3D by Vconf -m prep SDfile
Find this compound or compounds like it in BindingDB:
Activity Spreadsheet -- Enzyme Inhibition Constant Data from BindingDB
Found 1 hit for monomerid = 50521760
TargetMuscarinic acetylcholine receptor M4(Homo sapiens (Human))
Vanderbilt University
Curated by ChEMBL
LigandPNGBDBM50521760(CHEMBL4447294)
Affinity DataEC50:  260nM. Assay description: Positive allosteric modulation of human M4 AchR expressed in CHO cells co-expressing Gqi5 assessed as increase in acetylcholine-induced calcium mobil...
Ligand InfoPC cidPC sid
In DepthDetails ArticlePubMed