BDBM50521774 CHEMBL4446559
SMILES COc1ccc(CNC(=O)c2sc3c(c2N)c(C)cc2nc(C)nn32)cc1F
InChI Key InChIKey=RJLCNZFAIKMUED-UHFFFAOYSA-N
Data  1 EC50
  Tab Delimited (TSV)   2D SDfile   Computed 3D by Vconf -m prep SDfile
Find this compound or compounds like it in BindingDB:
Activity Spreadsheet -- Enzyme Inhibition Constant Data from BindingDB
Found 1 hit for monomerid = 50521774
TargetMuscarinic acetylcholine receptor M4(Homo sapiens (Human))
Vanderbilt University
Curated by ChEMBL
LigandPNGBDBM50521774(CHEMBL4446559)
Affinity DataEC50:  160nM. Assay description: Positive allosteric modulation of human M4 AchR expressed in CHO cells co-expressing Gqi5 assessed as increase in acetylcholine-induced calcium mobil...
Ligand InfoPC cidPC sid
In DepthDetails ArticlePubMed