BDBM50521780 CHEMBL4439440
SMILES Cc1c(Cl)c2nncn2c2sc(C(=O)N[C@H]3CCc4ccccc34)c(N)c12
InChI Key InChIKey=YZFWKSOATWRFKV-LBPRGKRZSA-N
Data  1 EC50
  Tab Delimited (TSV)   2D SDfile   Computed 3D by Vconf -m prep SDfile
Find this compound or compounds like it in BindingDB:
Activity Spreadsheet -- Enzyme Inhibition Constant Data from BindingDB
Found 1 hit for monomerid = 50521780
TargetMuscarinic acetylcholine receptor M4(Homo sapiens (Human))
Vanderbilt University
Curated by ChEMBL
LigandPNGBDBM50521780(CHEMBL4439440)
Affinity DataEC50:  20nM. Assay description: Positive allosteric modulation of human M4 AchR expressed in CHO cells co-expressing Gqi5 assessed as increase in acetylcholine-induced calcium mobil...
Ligand InfoPC cidPC sid
In DepthDetails ArticlePubMed