BDBM50521788 CHEMBL4449879
SMILES Cc1cc2ncnn2c2sc(C(=O)NC3Cc4cccnc4C3)c(N)c12
InChI Key InChIKey=SFXVLENGUQBVFY-UHFFFAOYSA-N
Data  1 EC50
  Tab Delimited (TSV)   2D SDfile   Computed 3D by Vconf -m prep SDfile
Find this compound or compounds like it in BindingDB:
Activity Spreadsheet -- Enzyme Inhibition Constant Data from BindingDB
Found 1 hit for monomerid = 50521788
TargetMuscarinic acetylcholine receptor M4(Homo sapiens (Human))
Vanderbilt University
Curated by ChEMBL
LigandPNGBDBM50521788(CHEMBL4449879)
Affinity DataEC50:  86nM. Assay description: Positive allosteric modulation of human M4 AchR expressed in CHO cells co-expressing Gqi5 assessed as increase in acetylcholine-induced calcium mobil...
Ligand InfoPC cidPC sid
In DepthDetails ArticlePubMed