BDBM50525039 CHEMBL4591835
SMILES Cn1c(SCCCN2CCC3(CC2)CCN(CC3)c2ccccc2O)nnc1-c1ccccc1
InChI Key InChIKey=ROHKDSZWDXPTKF-UHFFFAOYSA-N
Data  2 KI
  Tab Delimited (TSV)   2D SDfile   Computed 3D by Vconf -m prep SDfile
Find this compound or compounds like it in BindingDB:
Activity Spreadsheet -- Enzyme Inhibition Constant Data from BindingDB
Found 2 hits for monomerid = 50525039
TargetD(3) dopamine receptor(Homo sapiens (Human))
University Of Pennsylvania
Curated by ChEMBL
LigandPNGBDBM50525039(CHEMBL4591835)
Affinity DataKi:  396nM. Assay description: Displacement of [125I]IABN from recombinant human D3 receptor stably expressed in HEK293 cell membranes measured after 60 mins by scintillation count...
Ligand InfoPC cidPC sid
In DepthDetails ArticlePubMed
TargetD(2) dopamine receptor(Homo sapiens (Human))
University Of Pennsylvania
Curated by ChEMBL
LigandPNGBDBM50525039(CHEMBL4591835)
Affinity DataKi:  1.76E+4nM. Assay description: Displacement of [125I]IABN from recombinant human D2 long receptor stably expressed in HEK293 cell membranes measured after 60 mins by scintillation ...
Ligand InfoPC cidPC sid
In DepthDetails ArticlePubMed