BDBM50525048 CHEMBL4588709
SMILES CCCSc1nnc(-c2ccccc2)n1C
InChI Key InChIKey=CBFQPELWTJSDFA-UHFFFAOYSA-N
Data  2 KI
  Tab Delimited (TSV)   2D SDfile   Computed 3D by Vconf -m prep SDfile
Find this compound or compounds like it in BindingDB:
Activity Spreadsheet -- Enzyme Inhibition Constant Data from BindingDB
Found 2 hits for monomerid = 50525048
TargetD(3) dopamine receptor(Homo sapiens (Human))
University Of Pennsylvania
Curated by ChEMBL
LigandPNGBDBM50525048(CHEMBL4588709)
Affinity DataKi: >5.03E+4nM. Assay description: Displacement of [125I]IABN from recombinant human D3 receptor stably expressed in HEK293 cell membranes measured after 60 mins by scintillation count...
In DepthDetails ArticlePubMed
TargetD(2) dopamine receptor(Homo sapiens (Human))
University Of Pennsylvania
Curated by ChEMBL
LigandPNGBDBM50525048(CHEMBL4588709)
Affinity DataKi:  1.80E+5nM. Assay description: Displacement of [125I]IABN from recombinant human D2 long receptor stably expressed in HEK293 cell membranes measured after 60 mins by scintillation ...
In DepthDetails ArticlePubMed