BDBM50525049 CHEMBL4472434
SMILES Cn1c(SCCCN2CCC3(CCNCC3)CC2)nnc1-c1ccccc1
InChI Key InChIKey=UDZHORRPPMFMKH-UHFFFAOYSA-N
Data  2 KI
  Tab Delimited (TSV)   2D SDfile   Computed 3D by Vconf -m prep SDfile
Find this compound or compounds like it in BindingDB:
Activity Spreadsheet -- Enzyme Inhibition Constant Data from BindingDB
Found 2 hits for monomerid = 50525049
TargetD(3) dopamine receptor(Homo sapiens (Human))
University Of Pennsylvania
Curated by ChEMBL
LigandPNGBDBM50525049(CHEMBL4472434)
Affinity DataKi:  1.15E+3nM. Assay description: Displacement of [125I]IABN from recombinant human D3 receptor stably expressed in HEK293 cell membranes measured after 60 mins by scintillation count...
Ligand InfoPC cidPC sid
In DepthDetails ArticlePubMed
TargetD(2) dopamine receptor(Homo sapiens (Human))
University Of Pennsylvania
Curated by ChEMBL
LigandPNGBDBM50525049(CHEMBL4472434)
Affinity DataKi: >2.26E+5nM. Assay description: Displacement of [125I]IABN from recombinant human D2 long receptor stably expressed in HEK293 cell membranes measured after 60 mins by scintillation ...
Ligand InfoPC cidPC sid
In DepthDetails ArticlePubMed