BDBM50525055 CHEMBL4461920
SMILES COc1ccccc1N1CCC2(CCN(CCCSc3ncc([nH]3)-c3ccccc3)CC2)CC1
InChI Key InChIKey=NQVCRJIGEWITKT-UHFFFAOYSA-N
Data  2 KI
  Tab Delimited (TSV)   2D SDfile   Computed 3D by Vconf -m prep SDfile
Find this compound or compounds like it in BindingDB:
Activity Spreadsheet -- Enzyme Inhibition Constant Data from BindingDB
Found 2 hits for monomerid = 50525055
TargetD(3) dopamine receptor(Homo sapiens (Human))
University Of Pennsylvania
Curated by ChEMBL
LigandPNGBDBM50525055(CHEMBL4461920)
Affinity DataKi:  383nM. Assay description: Displacement of [125I]IABN from recombinant human D3 receptor stably expressed in HEK293 cell membranes measured after 60 mins by scintillation count...
Ligand InfoPC cidPC sid
In DepthDetails ArticlePubMed
TargetD(2) dopamine receptor(Homo sapiens (Human))
University Of Pennsylvania
Curated by ChEMBL
LigandPNGBDBM50525055(CHEMBL4461920)
Affinity DataKi:  5.89E+3nM. Assay description: Displacement of [125I]IABN from recombinant human D2 long receptor stably expressed in HEK293 cell membranes measured after 60 mins by scintillation ...
Ligand InfoPC cidPC sid
In DepthDetails ArticlePubMed