BDBM50525519 CHEMBL4446628
SMILES Clc1ccc(CO\N=C\c2c(nc3occn23)-c2ccc3ccccc3c2)c(Cl)c1
InChI Key InChIKey=DMGHCKHRLCSCBM-LGJNPRDNSA-N
Data  1 EC50
  Tab Delimited (TSV)   2D SDfile   Computed 3D by Vconf -m prep SDfile
Find this compound or compounds like it in BindingDB:
Activity Spreadsheet -- Enzyme Inhibition Constant Data from BindingDB
Found 1 hit for monomerid = 50525519
TargetNuclear receptor subfamily 1 group I member 3(Homo sapiens (Human))
University Of Maryland
Curated by ChEMBL
LigandPNGBDBM50525519(CHEMBL4446628)
Affinity DataEC50:  1.50E+3nM. Assay description: Agonist activity at human CAR transfected in human HepG2 cells cotransfected with CYP2B6 incubated for 23 hrs by luciferase reported gene assay
Ligand InfoPC cidPC sid
In DepthDetails ArticlePubMed